Target
Fibroblast growth factor receptor 2
Ligand
BDBM335686
Substrate
Meas. Tech.
FGFR2 (Enzymatic Assay)
IC50
251±n/a nM
Citation
 Angibaud, PRPilatte, INQuerolle, OA Compounds US Patent  US9737544 Publication Date 8/22/2017 
Target
Name:
Fibroblast growth factor receptor 2
Synonyms:
BEK FGFR-2 FGFR2 Fibroblast growth factor receptor 2 (FGFR2) KGFR Keratinocyte growth factor receptor VEGF-receptor 2 and Fibroblast growth factor receptor 2
Type:
Enzyme
Mol. Mass.:
92015.45
Organism:
Homo sapiens (Human)
Description:
P21802
Residue:
821
  
Inhibitor
Name:
BDBM335686
Synonyms:
US9737544, Compound 18
Type:
Small organic molecule
Emp. Form.:
C19H14N4O2
Mol. Mass.:
330.3401
SMILES:
Cn1cc(cn1)-c1cnc2ccc(nc2c1)C(=O)c1cccc(O)c1
: