Target
Fibroblast growth factor receptor 4
Ligand
BDBM335695
Substrate
Meas. Tech.
FGFR4 (Enzymatic Assay)
IC50
251±n/a nM
Citation
 Angibaud, PRPilatte, INQuerolle, OA Compounds US Patent  US9737544 Publication Date 8/22/2017 
Target
Name:
Fibroblast growth factor receptor 4
Synonyms:
CD_antigen: CD334 FGFR4 FGFR4 Fibroblast growth factor receptor JK2 TKF
Type:
Protein
Mol. Mass.:
87957.45
Organism:
Homo sapiens (Human)
Description:
P22455
Residue:
802
  
Inhibitor
Name:
BDBM335695
Synonyms:
US9737544, Compound 13
Type:
Small organic molecule
Emp. Form.:
C23H24N4O3
Mol. Mass.:
404.4617
SMILES:
COc1cc(OC)cc(c1)C(CCO)c1ccc2ncc(cc2n1)-c1cnn(C)c1
: