Target
Protein farnesyltransferase/geranylgeranyltransferase type-1 subunit alpha
Ligand
BDBM13405
Substrate
K-ras(B) decapeptide
Meas. Tech.
Enzyme Inhibition Assay
IC50
0.44±n/a nM
Citation
 Wang, LWang, GTWang, XTong, YSullivan, GPark, DLeonard, NMLi, QCohen, JGu, WZZhang, HBauch, JLJakob, CGHutchins, CWStoll, VSMarsh, KRosenberg, SHSham, HLLin, NH Design, synthesis, and biological activity of 4-[(4-cyano-2-arylbenzyloxy)-(3-methyl-3H-imidazol-4-yl)methyl]benzonitriles as potent and selective farnesyltransferase inhibitors. J Med Chem 47:612-26 (2004)  
Target
Name:
Protein farnesyltransferase/geranylgeranyltransferase type-1 subunit alpha
Synonyms:
CAAX farnesyltransferase alpha subunit FNTA_HUMAN FTase-alpha Geranylgeranyl Transferase (GGTase-I) Chain A Protein Farnesyltransferase (PFT) Chain A Protein farnesyltransferase Protein farnesyltransferase/geranylgeranyltransferase type I alpha subunit | Ras proteins prenyltransferase alpha
Type:
Enzyme
Mol. Mass.:
44392.46
Organism:
Homo sapiens (Human)
Description:
Recombinant human FTase.
Residue:
379
  
Inhibitor
Name:
BDBM13405
Synonyms:
3-(3-chlorophenyl)-4-{[(4-cyano-3-fluorophenyl)(1-methyl-1H-imidazol-5-yl)methoxy]methyl}benzonitrile | A313326 Analogue 49
Type:
Small organic molecule
Emp. Form.:
C26H18ClFN4O
Mol. Mass.:
456.899
SMILES:
Cn1cncc1C(OCc1ccc(cc1-c1cccc(Cl)c1)C#N)c1ccc(C#N)c(F)c1
:
Substrate
Name:
K-ras(B) decapeptide
Synonyms:
biotin conjugated K-ras decapeptide
Type:
Peptide
Mol. Mass.:
1611.07
Organism:
Description:
Residue:
14
ITINKKSKTKCVIM