Target
Catenin beta-1 [138-686]
Ligand
BDBM50094606
Substrate
Meas. Tech.
Fluorescence Polarization (FP) Assay
Ki
195470±870 nM
Citation
 Ji, HYu, BZhang, MGuo, W Substituted 1H-indazol-1-OL analogs as inhibitors of beta catenin/Tcf protein-protein interactions US Patent  US9738628 Publication Date 8/22/2017 
Target
Name:
Catenin beta-1 [138-686]
Synonyms:
Beta-catenin CTNNB | CTNNB1
Type:
Protein
Mol. Mass.:
60127.24
Organism:
Homo sapiens (Human)
Description:
aa 138-686
Residue:
549
  
Inhibitor
Name:
BDBM50094606
Synonyms:
CHEMBL3589009 US9738628, Compound iCRT3
Type:
Small organic molecule
Emp. Form.:
C23H26N2O2S
Mol. Mass.:
394.53
SMILES:
CCc1ccc(cc1)-c1nc(CSCC(=O)NCCc2ccccc2)c(C)o1
: