Target
Histamine receptor H3
Ligand
BDBM200815
Substrate
Meas. Tech.
Radioligand binding assay
Ki
37.6±0 nM
Citation
 Gao, ZHall, DStefany, D Substituted N-heteroaryl spirolactam bipyrrolidines, preparation and therapeutic use thereof US Patent  US9533995 Publication Date 1/3/2017 
Target
Name:
Histamine receptor H3
Synonyms:
Type:
Enzyme
Mol. Mass.:
48611.84
Organism:
Macaca mulatta (Rhesus macaque)
Description:
Q865E1
Residue:
445
  
Inhibitor
Name:
BDBM200815
Synonyms:
1 2-[2-Methyl-6-((2S,3′R)-2-methyl-[1,3′]bipyrrolidinyl-1′-yl)-pyridin-3-yl]-8-oxa-2-aza-spiro[4.5]decan-1-one | US9533995, 1
Type:
Small organic molecule
Emp. Form.:
C23H34N4O2
Mol. Mass.:
398.5417
SMILES:
C[C@H]1CCCN1[C@@H]1CCN(C1)c1ccc(N2CCC3(CCOCC3)C2=O)c(C)n1
: