Target
Histamine receptor H3
Ligand
BDBM200830
Substrate
Meas. Tech.
Radioligand binding assay
Ki
26.3±0 nM
Citation
 Gao, ZHall, DStefany, D Substituted N-heteroaryl spirolactam bipyrrolidines, preparation and therapeutic use thereof US Patent  US9533995 Publication Date 1/3/2017 
Target
Name:
Histamine receptor H3
Synonyms:
Type:
Enzyme
Mol. Mass.:
48611.84
Organism:
Macaca mulatta (Rhesus macaque)
Description:
Q865E1
Residue:
445
  
Inhibitor
Name:
BDBM200830
Synonyms:
2-[5-((2s,3's)-2-methyl-[1,3']bipyrrolidinyl-1'-yl)-pyrazin-2-yl]-2,8-diaza-spiro[4.5]decan-1-one | US9533995, 10
Type:
Small organic molecule
Emp. Form.:
C21H32N6O
Mol. Mass.:
384.5184
SMILES:
C[C@H]1CCCN1[C@H]1CCN(C1)c1cnc(cn1)N1CCC2(CCNCC2)C1=O
: