Target
Glucocorticoid receptor
Ligand
BDBM141368
Substrate
Meas. Tech.
Radioligand Binding Assay
IC50
1.36±n/a nM
Citation
 Berger, MRehwinkel, HDahmen, JEriksson, AHansson, THossain, NKlingstedt, PTLepisto, MNilsson, SHemmerling, MEdman, K Phenyl and benzodioxinyl substituted indazoles derivatives US Patent  US9738632 Publication Date 8/22/2017 
Target
Name:
Glucocorticoid receptor
Synonyms:
GCR_HUMAN GRL Glucocorticoid receptor (GRFP) Nuclear receptor subfamily 3 group C member 1
Type:
Enzyme
Mol. Mass.:
85656.87
Organism:
Homo sapiens (Human)
Description:
P04150
Residue:
777
  
Inhibitor
Name:
BDBM141368
Synonyms:
US8916600, 2 US9738632, Example 2
Type:
Small organic molecule
Emp. Form.:
C32H32F2N4O7S
Mol. Mass.:
654.681
SMILES:
C[C@H](NC(=O)C(C)(F)F)[C@H](Oc1ccc2n(ncc2c1)-c1cccc(c1)C(=O)N[C@@H]1CCS(=O)(=O)C1)c1ccc2OCCOc2c1
: