Target
Lysine-specific demethylase 4C
Ligand
BDBM320367
Substrate
Meas. Tech.
Enzymatic Assay
IC50
550±n/a nM
Citation
 Chen, YKWallace, MB Histone demethylase inhibitors US Patent  US9738637 Publication Date 8/22/2017 
Target
Name:
Lysine-specific demethylase 4C
Synonyms:
GASC-1 protein Gene amplified in squamous cell carcinoma 1 protein JMJD2C Jumonji domain-containing protein 2C KDM4C_HUMAN | KIAA0780
Type:
Protein
Mol. Mass.:
119979.01
Organism:
Homo sapiens (Human)
Description:
Q9H3R0
Residue:
1056
  
Inhibitor
Name:
BDBM320367
Synonyms:
2-(hydroxymethyl)-1H- pyrrolo[3,2-b]pyridine-7- carboxylic acid US9738637, Example 10
Type:
Small organic molecule
Emp. Form.:
C9H8N2O3
Mol. Mass.:
192.1714
SMILES:
OCc1cc2nccc(C(O)=O)c2[nH]1
: