Target
Lysine-specific demethylase 5A
Ligand
BDBM320429
Substrate
Meas. Tech.
Enzymatic Assay
IC50
<100±n/a nM
Citation
 Chen, YKWallace, MB Histone demethylase inhibitors US Patent  US9738637 Publication Date 8/22/2017 
Target
Name:
Lysine-specific demethylase 5A
Synonyms:
Histone demethylase JARID1A Jumonji/ARID domain-containing protein 1A KDM5A_HUMAN RBBP-2 RBP2 | Retinoblastoma-binding protein 2
Type:
Protein
Mol. Mass.:
192091.79
Organism:
Homo sapiens (Human)
Description:
P29375
Residue:
1690
  
Inhibitor
Name:
BDBM320429
Synonyms:
2-[(2-chloro-4-fluoro- phenoxy)methyl]-1H-pyrrolo- [3,2-b]pyridine-7-carboxylic acid US9738637, Example 96
Type:
Small organic molecule
Emp. Form.:
C15H10ClFN2O3
Mol. Mass.:
320.703
SMILES:
OC(=O)c1ccnc2cc(COc3ccc(F)cc3Cl)[nH]c12
: