Target
Carbonic anhydrase 2
Ligand
BDBM11637
Substrate
BDBM11326
Meas. Tech.
Carbonic Anhydrase Inhibition Assay
pH
7.8±n/a
Temperature
293.15±n/a K
IC50
42±n/a nM
Citation
 Ho, YTPurohit, AVicker, NNewman, SPRobinson, JJLeese, MPGaneshapillai, DWoo, LWPotter, BVReed, MJ Inhibition of carbonic anhydrase II by steroidal and non-steroidal sulphamates. Biochem Biophys Res Commun 305:909-14 (2003)  
Target
Name:
Carbonic anhydrase 2
Synonyms:
CA-II CAC Carbonate dehydratase II Carbonic anhydrase 2 (CA-II) Carbonic anhydrase C Carbonic anhydrase II (CA-II) Carbonic anhydrase II (hCA II) | Carbonic anhydrase isoenzyme II (hCA II)
Type:
Enzyme
Mol. Mass.:
29250.71
Organism:
Homo sapiens (Human)
Description:
P00918
Residue:
260
  
Inhibitor
Name:
BDBM11637
Synonyms:
(15S)-15-methyl-14-oxotetracyclo[8.7.0.0^{2,7}.0^{11,15}]heptadeca-2(7),3,5-trien-5-yl sulfamate estrone-3-O-sulfamate | sulfamate compound 4
Type:
Small organic molecule
Emp. Form.:
C18H23NO4S
Mol. Mass.:
349.445
SMILES:
C[C@]12CCC3C(CCc4cc(OS(N)(=O)=O)ccc34)C1CCC2=O
:
Substrate
Name:
BDBM11326
Synonyms:
4-nitrophenyl acetate | p-Nitrophenyl Acetate
Type:
Small organic molecule
Emp. Form.:
C8H7NO4
Mol. Mass.:
181.1455
SMILES:
CC(=O)Oc1ccc(cc1)[N+]([O-])=O
: