Target
Transient receptor potential cation channel subfamily V member 1
Ligand
BDBM245008
Substrate
Meas. Tech.
Functional Assay
IC50
10.00±n/a nM
Citation
 Allison, BDBranstetter, BJBreitenbucher, JGHack, MDHawryluk, NALebsack, ADMcClure, KJMerit, JE Tetrahydro-pyrimidoazepines as modulators of TRPV1 US Patent  US9738649 Publication Date 8/22/2017 
Target
Name:
Transient receptor potential cation channel subfamily V member 1
Synonyms:
Capsaicin receptor Osm-9-like TRP channel 1 TRPV1_HUMAN Transient receptor potential cation channel subfamily V member 1 (TRPV1) Transient receptor potential cation channel subfamily V member 1(TRPV1) Vanilloid VR1 Vanilloid receptor 1 Vanilloid receptor 1 (VRI/TRPV1)
Type:
Protein
Mol. Mass.:
94960.75
Organism:
Homo sapiens (Human)
Description:
Q8NER1
Residue:
839
  
Inhibitor
Name:
BDBM245008
Synonyms:
US9422293, 245 | US9738649, Example 245
Type:
Small organic molecule
Emp. Form.:
C26H25ClF6N6O
Mol. Mass.:
586.96
SMILES:
FC(F)(F)c1ccc(Nc2nc(nc3CCN(CCc23)c2ncccc2C(F)(F)F)N2CCCOCC2)cc1Cl
: