Target
Plasma kallikrein
Ligand
BDBM335794
Substrate
Meas. Tech.
Enzyme Inhibition Assay
Ki
1.39±n/a nM
Citation
 Pinto, DJClarke, CGSmith, II, LMOrwat, MJJeon, YCorte, JR Tetrahydroisoquinolines containing substituted azoles as factor XIa inhibitors US Patent  US9738655 Publication Date 8/22/2017 
Target
Name:
Plasma kallikrein
Synonyms:
Fletcher factor KLKB1 Kallikrein Plasma kallikrein heavy chain Plasma prekallikrein
Type:
Protein
Mol. Mass.:
71391.16
Organism:
Homo sapiens (Human)
Description:
P03952
Residue:
638
  
Inhibitor
Name:
BDBM335794
Synonyms:
(S)-4-(2-(1-(3-chloro-2- fluorophenyl)-1H-1,2,3- triazole-4-carbonyl)-5-(4- (dimethylamino)piperidin-1- yl)-1,2,3,4- tetrahydroisoquinoline-1- carboxamido)benzoic acid, bis-TFA salt | US9738655, Example 49
Type:
Small organic molecule
Emp. Form.:
C33H33ClFN7O4
Mol. Mass.:
646.111
SMILES:
CN(C)C1CCN(CC1)c1cccc2[C@H](N(CCc12)C(=O)c1cn(nn1)-c1cccc(Cl)c1F)C(=O)Nc1ccc(cc1)C(O)=O
: