Target
Plasma kallikrein
Ligand
BDBM335812
Substrate
Meas. Tech.
Enzyme Inhibition Assay
Ki
2.57±n/a nM
Citation
 Pinto, DJClarke, CGSmith, II, LMOrwat, MJJeon, YCorte, JR Tetrahydroisoquinolines containing substituted azoles as factor XIa inhibitors US Patent  US9738655 Publication Date 8/22/2017 
Target
Name:
Plasma kallikrein
Synonyms:
Fletcher factor KLKB1 Kallikrein Plasma kallikrein heavy chain Plasma prekallikrein
Type:
Protein
Mol. Mass.:
71391.16
Organism:
Homo sapiens (Human)
Description:
P03952
Residue:
638
  
Inhibitor
Name:
BDBM335812
Synonyms:
(S)-4-(2-(1-(3-chloro-2- fluorophenyl)-1H-1,2,3- triazole-4-carbonyl)-5-(3- isopropyl-5,6-dihydro- [1,2,4]triazolo[4,3-a]pyrazin- 7(8H)-yl)-1,2,3,4- tetrahydroisoquinoline-1- carboxamido)benzoic acid, TFA salt | US9738655, Example 66
Type:
Small organic molecule
Emp. Form.:
C34H31ClFN9O4
Mol. Mass.:
684.119
SMILES:
CC(C)c1nnc2CN(CCn12)c1cccc2[C@H](N(CCc12)C(=O)c1cn(nn1)-c1cccc(Cl)c1F)C(=O)Nc1ccc(cc1)C(O)=O
: