Target
Plasma kallikrein
Ligand
BDBM335982
Substrate
Meas. Tech.
Enzyme Inhibition Assay
Ki
1.34±n/a nM
Citation
 Pinto, DJClarke, CGSmith, II, LMOrwat, MJJeon, YCorte, JR Tetrahydroisoquinolines containing substituted azoles as factor XIa inhibitors US Patent  US9738655 Publication Date 8/22/2017 
Target
Name:
Plasma kallikrein
Synonyms:
Fletcher factor KLKB1 Kallikrein Plasma kallikrein heavy chain Plasma prekallikrein
Type:
Protein
Mol. Mass.:
71391.16
Organism:
Homo sapiens (Human)
Description:
P03952
Residue:
638
  
Inhibitor
Name:
BDBM335982
Synonyms:
4-(2-(1-(3-chloro-2- fluorophenyl)-1H-1,2,3- triazole-4-carbonyl)-5-(4- (pyrrolidin-1-yl)piperidin- 1-yl)-1,2,3,4- tetrahydroisoquinoline-1- carboxamido)benzoic acid, 2 TFA salt | US9738655, Example 210
Type:
Small organic molecule
Emp. Form.:
C35H35ClFN7O4
Mol. Mass.:
672.148
SMILES:
OC(=O)c1ccc(NC(=O)C2N(CCc3c2cccc3N2CCC(CC2)N2CCCC2)C(=O)c2cn(nn2)-c2cccc(Cl)c2F)cc1
: