Target
Plasma kallikrein
Ligand
BDBM336052
Substrate
Meas. Tech.
Enzyme Inhibition Assay
Ki
4.87±n/a nM
Citation
 Pinto, DJClarke, CGSmith, II, LMOrwat, MJJeon, YCorte, JR Tetrahydroisoquinolines containing substituted azoles as factor XIa inhibitors US Patent  US9738655 Publication Date 8/22/2017 
Target
Name:
Plasma kallikrein
Synonyms:
Fletcher factor KLKB1 Kallikrein Plasma kallikrein heavy chain Plasma prekallikrein
Type:
Protein
Mol. Mass.:
71391.16
Organism:
Homo sapiens (Human)
Description:
P03952
Residue:
638
  
Inhibitor
Name:
BDBM336052
Synonyms:
4-(2-(1-(3-chloro-2- fluorophenyl)-1H-1,2,3-triazole- 4-carbonyl)-5-(4-methyl-3- oxopiperazin-1-yl)-1,2,3,4- tetrahydroisoquinoline-1- carboxamido)benzoic acid, TFA salt | US9738655, Example 274
Type:
Small organic molecule
Emp. Form.:
C31H27ClFN7O5
Mol. Mass.:
632.041
SMILES:
CN1CCN(CC1=O)c1cccc2C(N(CCc12)C(=O)c1cn(nn1)-c1cccc(Cl)c1F)C(=O)Nc1ccc(cc1)C(O)=O
: