Target
cGMP-dependent protein kinase 2 [41-418,G356E]
Ligand
BDBM65501
Substrate
Meas. Tech.
Microfluidic Mobility-Shift Assay
pH
7±n/a
EC50
50±3.0 nM
Comments
extracted
Citation
 Campbell, JCHenning, PFranz, ESankaran, BHerberg, FWKim, C Structural Basis of Analog Specificity in PKG I and II. ACS Chem Biol 12:2388-2398 (2017)  
Target
Name:
cGMP-dependent protein kinase 2 [41-418,G356E]
Synonyms:
KGP2_HUMAN PRKGR2 | hPKG II 41−418 (G356E)
Type:
Mol. Mass.:
43354.14
Organism:
Homo sapiens (Human)
Description:
Q13237[41-418,G356E]
Residue:
378
  
Inhibitor
Name:
BDBM65501
Synonyms:
8-pCP-cGMP cGMP
Type:
Small organic molecule
Emp. Form.:
C16H15ClN5O7PS
Mol. Mass.:
487.811
SMILES:
Nc1nc(=O)c2nc(Sc3ccc(Cl)cc3)n([C@@H]3O[C@@H]4COP(O)(=O)O[C@H]4[C@H]3O)c2[nH]1
: