Target
Intermediate conductance calcium-activated potassium channel protein 4
Ligand
BDBM200861
Substrate
Meas. Tech.
KCa3.1 Assay
IC50
350±0 nM
Citation
 Burke, MJMcKibben, BTschantz, MA Fused thiazin-3-ones as KCA3.1 inhibitors US Patent  US9533999 Publication Date 1/3/2017 
Target
Name:
Intermediate conductance calcium-activated potassium channel protein 4
Synonyms:
IK1 KCA4 KCNN4_HUMAN SK4
Type:
PROTEIN
Mol. Mass.:
47723.22
Organism:
Homo sapiens (Human)
Description:
ChEMBL_1361891
Residue:
427
  
Inhibitor
Name:
BDBM200861
Synonyms:
US9533999, i-17
Type:
Small organic molecule
Emp. Form.:
C15H11F3N2O4S
Mol. Mass.:
372.319
SMILES:
FC(F)(F)Oc1cccc(CN2C(=O)CS(=O)(=O)c3cccnc23)c1
: