Target
Intermediate conductance calcium-activated potassium channel protein 4
Ligand
BDBM200970
Substrate
Meas. Tech.
KCa3.1 Assay
IC50
400±0 nM
Citation
 Burke, MJMcKibben, BTschantz, MA Fused thiazin-3-ones as KCA3.1 inhibitors US Patent  US9533999 Publication Date 1/3/2017 
Target
Name:
Intermediate conductance calcium-activated potassium channel protein 4
Synonyms:
IK1 KCA4 KCNN4_HUMAN SK4
Type:
PROTEIN
Mol. Mass.:
47723.22
Organism:
Homo sapiens (Human)
Description:
ChEMBL_1361891
Residue:
427
  
Inhibitor
Name:
BDBM200970
Synonyms:
US9533999, ii-21
Type:
Small organic molecule
Emp. Form.:
C17H17F3N2OS2
Mol. Mass.:
386.455
SMILES:
CC(C)c1nc2N(C(C)c3cccc(c3)C(F)(F)F)C(=O)CSc2s1
: