Target
Kallikrein-7
Ligand
BDBM336163
Substrate
Meas. Tech.
Inhibition Assay
IC50
380±n/a nM
Citation
 Linschoten, M Kallikrein 7 inhibitors US Patent  US9744148 Publication Date 8/29/2017 
Target
Name:
Kallikrein-7
Synonyms:
KLK7 Kallikrein 7 PRSS6 Serine protease 6 hK7 kallikrein-7 isoform 1 preproprotein
Type:
PROTEIN
Mol. Mass.:
27535.05
Organism:
Homo sapiens (Human)
Description:
ChEMBL_1469257
Residue:
253
  
Inhibitor
Name:
BDBM336163
Synonyms:
US9744148, 32
Type:
Small organic molecule
Emp. Form.:
C22H18ClNO3
Mol. Mass.:
379.836
SMILES:
Clc1ccc(CC(=O)OC(C(=O)Nc2ccccc2)c2ccccc2)cc1
: