Target
Kallikrein-7
Ligand
BDBM336170
Substrate
Meas. Tech.
Inhibition Assay
IC50
480±n/a nM
Citation
 Linschoten, M Kallikrein 7 inhibitors US Patent  US9744148 Publication Date 8/29/2017 
Target
Name:
Kallikrein-7
Synonyms:
KLK7 Kallikrein 7 PRSS6 Serine protease 6 hK7 kallikrein-7 isoform 1 preproprotein
Type:
PROTEIN
Mol. Mass.:
27535.05
Organism:
Homo sapiens (Human)
Description:
ChEMBL_1469257
Residue:
253
  
Inhibitor
Name:
BDBM336170
Synonyms:
US9744148, 39
Type:
Small organic molecule
Emp. Form.:
C16H16Cl2N2O4
Mol. Mass.:
371.215
SMILES:
CCC(OC(=O)Cc1ccc(Cl)c(Cl)c1)C(=O)Nc1cc(C)on1
: