Target
Beta-secretase 1
Ligand
BDBM223370
Substrate
Meas. Tech.
Cell-Free Assay
IC50
372±n/a nM
Citation
 Brodney, MABeck, EMButler, CRZhang, LO Neill, BTBarreiro, GLaChapelle, EARogers, BN 2-amino 6-methyl-4,4a,5,6-tetrahydropyrano[3,4-d][1,3]thiazin-8a(8H)-yl-1,3-thiazol-4-yl amides US Patent  US9744173 Publication Date 8/29/2017 
Target
Name:
Beta-secretase 1
Synonyms:
ASP2 Aspartyl protease 2 BACE1 Beta-secretase (BACE) Beta-secretase 1 (BACE 1) Beta-secretase 1 (BACE1) Beta-site amyloid precursor protein cleaving enzyme 1 Memapsin-2 beta-Secretase (BACE-1) | beta-Secretase (BACE1)
Type:
Protein
Mol. Mass.:
55755.10
Organism:
Homo sapiens (Human)
Description:
P56817
Residue:
501
  
Inhibitor
Name:
BDBM223370
Synonyms:
US9315520, 57 | US9744173, Example 57
Type:
Small organic molecule
Emp. Form.:
C19H23FN6O3S2
Mol. Mass.:
466.553
SMILES:
C[C@H](F)COc1cnc(cn1)C(=O)Nc1csc(n1)[C@]12CO[C@@H](C)C[C@H]1CSC(N)=N2
: