Target
Beta-secretase 1
Ligand
BDBM336559
Substrate
Meas. Tech.
Cell-Free Assay
IC50
51000±n/a nM
Citation
 Brodney, MABeck, EMButler, CRZhang, LO Neill, BTBarreiro, GLaChapelle, EARogers, BN 2-amino 6-methyl-4,4a,5,6-tetrahydropyrano[3,4-d][1,3]thiazin-8a(8H)-yl-1,3-thiazol-4-yl amides US Patent  US9744173 Publication Date 8/29/2017 
Target
Name:
Beta-secretase 1
Synonyms:
ASP2 Aspartyl protease 2 BACE1 Beta-secretase (BACE) Beta-secretase 1 (BACE 1) Beta-secretase 1 (BACE1) Beta-site amyloid precursor protein cleaving enzyme 1 Memapsin-2 beta-Secretase (BACE-1) | beta-Secretase (BACE1)
Type:
Protein
Mol. Mass.:
55755.10
Organism:
Homo sapiens (Human)
Description:
P56817
Residue:
501
  
Inhibitor
Name:
BDBM336559
Synonyms:
N-{2-[(4aR,6S,8aR)-2-amino-6-methyl-4,4a,5,6- | US9744173, Example 65
Type:
Small organic molecule
Emp. Form.:
C20H28N6O2S2
Mol. Mass.:
448.605
SMILES:
CC(C)Cc1cc(nn1C)C(=O)Nc1csc(n1)[C@]12CO[C@@H](C)C[C@H]1CSC(N)=N2
: