Target
Integrin alpha-IIb
Ligand
BDBM228621
Substrate
Meas. Tech.
Enzyme Assay
IC50
29.0±n/a nM
Citation
 Berger, MKruger, MLohrke, JReinhardt, MSiebeneicher, H Compounds for binding to the platelet specific glycoprotein IIb/IIIa and their use for imaging of thrombi US Patent  US9744252 Publication Date 8/29/2017 
Target
Name:
Integrin alpha-IIb
Synonyms:
CD_antigen=CD41 GPIIb Glycoprotein IIb ITGA2B Integrin alpha-IIb heavy chain Integrin alpha-IIb light chain, form 2 Integrin alpha-V/beta-3 and alpha-IIb/beta 3 | Platelet membrane glycoprotein IIb
Type:
Protein
Mol. Mass.:
113354.85
Organism:
Homo sapiens (Human)
Description:
P08514
Residue:
1039
  
Inhibitor
Name:
BDBM228621
Synonyms:
US9345793, 2 | US9744252, Example 2
Type:
Small organic molecule
Emp. Form.:
C25H36FN3O5
Mol. Mass.:
477.5688
SMILES:
OC(=O)C[C@H](NC(=O)[C@@H]1CCCN(C1)C(=O)CCC1CCNCC1)c1ccc(OCCF)cc1
: