Target
Nuclear receptor ROR-gamma
Ligand
BDBM332409
Substrate
Meas. Tech.
Biochemical TR-FRET Assay
IC50
52.0±n/a nM
Citation
 Barr, KJBienstock, CEMaclean, JKZhang, HBeresis, RTZhang, DAnthony, NJLapointe, BTTian, Y 4-heteroaryl substituted benzoic acid compounds as RORgammaT inhibitors and uses thereof US Patent  US9745265 Publication Date 8/29/2017 
Target
Name:
Nuclear receptor ROR-gamma
Synonyms:
Nr1f3 Nuclear receptor subfamily 1 group F member 3 RORG_MOUSE Rorc TOR Thymus orphan receptor
Type:
PROTEIN
Mol. Mass.:
58133.31
Organism:
Mus musculus
Description:
ChEMBL_103664
Residue:
516
  
Inhibitor
Name:
BDBM332409
Synonyms:
(E)-4-(1-(2-chloro-6-(prop-1-enyl)benzoyl)-1H-pyrazolo[4,3-b]pyridin-3-yl)-3-fluorobenzoic acid (1A) US9745265, 1A
Type:
Small organic molecule
Emp. Form.:
C23H15ClFN3O3
Mol. Mass.:
435.835
SMILES:
C\C=C\c1cccc(Cl)c1C(=O)n1nc(-c2ccc(cc2F)C(O)=O)c2ncccc12
: