Target
Nuclear receptor ROR-gamma
Ligand
BDBM332424
Substrate
Meas. Tech.
Biochemical TR-FRET Assay
IC50
159±n/a nM
Citation
 Barr, KJBienstock, CEMaclean, JKZhang, HBeresis, RTZhang, DAnthony, NJLapointe, BTTian, Y 4-heteroaryl substituted benzoic acid compounds as RORgammaT inhibitors and uses thereof US Patent  US9745265 Publication Date 8/29/2017 
Target
Name:
Nuclear receptor ROR-gamma
Synonyms:
Nr1f3 Nuclear receptor subfamily 1 group F member 3 RORG_MOUSE Rorc TOR Thymus orphan receptor
Type:
PROTEIN
Mol. Mass.:
58133.31
Organism:
Mus musculus
Description:
ChEMBL_103664
Residue:
516
  
Inhibitor
Name:
BDBM332424
Synonyms:
4-{1-[(2- bromo-3- chlorophenyl) carbonyl]-1H- indazol-3-yl}- 3-fluoro- benzoic acid US9745265, 1T
Type:
Small organic molecule
Emp. Form.:
C21H11BrClFN2O3
Mol. Mass.:
473.679
SMILES:
OC(=O)c1ccc(-c2nn(C(=O)c3cccc(Cl)c3Br)c3ccccc23)c(F)c1
: