Target
Nuclear receptor ROR-gamma
Ligand
BDBM332433
Substrate
Meas. Tech.
Biochemical TR-FRET Assay
IC50
2.00±n/a nM
Citation
 Barr, KJBienstock, CEMaclean, JKZhang, HBeresis, RTZhang, DAnthony, NJLapointe, BTTian, Y 4-heteroaryl substituted benzoic acid compounds as RORgammaT inhibitors and uses thereof US Patent  US9745265 Publication Date 8/29/2017 
Target
Name:
Nuclear receptor ROR-gamma
Synonyms:
Nr1f3 Nuclear receptor subfamily 1 group F member 3 RORG_MOUSE Rorc TOR Thymus orphan receptor
Type:
PROTEIN
Mol. Mass.:
58133.31
Organism:
Mus musculus
Description:
ChEMBL_103664
Residue:
516
  
Inhibitor
Name:
BDBM332433
Synonyms:
4-(1-(2- chloro-6- cyclopropyl- benzoyl)-1H- indazol-3- yl)-3-fluoro- benzoic acid US9745265, 1AC
Type:
Small organic molecule
Emp. Form.:
C24H16ClFN2O3
Mol. Mass.:
434.847
SMILES:
OC(=O)c1ccc(-c2nn(C(=O)c3c(Cl)cccc3C3CC3)c3ccccc23)c(F)c1
: