Target
Nuclear receptor ROR-gamma
Ligand
BDBM332435
Substrate
Meas. Tech.
Biochemical TR-FRET Assay
IC50
16.0±n/a nM
Citation
 Barr, KJBienstock, CEMaclean, JKZhang, HBeresis, RTZhang, DAnthony, NJLapointe, BTTian, Y 4-heteroaryl substituted benzoic acid compounds as RORgammaT inhibitors and uses thereof US Patent  US9745265 Publication Date 8/29/2017 
Target
Name:
Nuclear receptor ROR-gamma
Synonyms:
Nr1f3 Nuclear receptor subfamily 1 group F member 3 RORG_MOUSE Rorc TOR Thymus orphan receptor
Type:
PROTEIN
Mol. Mass.:
58133.31
Organism:
Mus musculus
Description:
ChEMBL_103664
Residue:
516
  
Inhibitor
Name:
BDBM332435
Synonyms:
4-(1-(2-chloro-6-(trifluoromethyl)benzoyl)-6-(morpholine-4-carbonyl)-1H-indazol-3-yl)benzoic acid (2A) US9745265, 7A
Type:
Small organic molecule
Emp. Form.:
C27H19ClF3N3O5
Mol. Mass.:
557.905
SMILES:
OC(=O)c1ccc(cc1)-c1nn(C(=O)c2c(Cl)cccc2C(F)(F)F)c2cc(ccc12)C(=O)N1CCOCC1
: