Target
Nuclear receptor ROR-gamma
Ligand
BDBM336581
Substrate
Meas. Tech.
Biochemical TR-FRET Assay
IC50
14.0±n/a nM
Citation
 Barr, KJBienstock, CEMaclean, JKZhang, HBeresis, RTZhang, DAnthony, NJLapointe, BTTian, Y 4-heteroaryl substituted benzoic acid compounds as RORgammaT inhibitors and uses thereof US Patent  US9745265 Publication Date 8/29/2017 
Target
Name:
Nuclear receptor ROR-gamma
Synonyms:
Nr1f3 Nuclear receptor subfamily 1 group F member 3 RORG_MOUSE Rorc TOR Thymus orphan receptor
Type:
PROTEIN
Mol. Mass.:
58133.31
Organism:
Mus musculus
Description:
ChEMBL_103664
Residue:
516
  
Inhibitor
Name:
BDBM336581
Synonyms:
4-(1-(2-chloro-6- (trifluoromethyl) benzoyl)-6- (cyclopropyl (methyl)carbamoyl)-1H- pyrazolo[4,3- b]pyridin-3-yl)-3- fluorobenzoic acid | US9745265, 7D
Type:
Small organic molecule
Emp. Form.:
C26H17ClF4N4O4
Mol. Mass.:
560.884
SMILES:
CN(C1CC1)C(=O)c1cnc2c(nn(C(=O)c3c(Cl)cccc3C(F)(F)F)c2c1)-c1ccc(cc1F)C(O)=O
: