Target
Cytochrome P450 11B1, mitochondrial
Ligand
BDBM336332
Substrate
IC50
900±n/a nM
Citation
 Ali, ALo, MMMetzger, EYin, LHartmann, RHu, QHeim, RZimmer, C Indoline compounds as aldosterone synthase inhibitors US Patent  US9745282 Publication Date 8/29/2017 
Target
Name:
Cytochrome P450 11B1, mitochondrial
Synonyms:
C11B1_HUMAN CYPXIB1 Cytochrome P450 11B1 Cytochrome P450 11B1, mitochondrial | S11BH
Type:
Enzyme
Mol. Mass.:
57591.44
Organism:
Homo sapiens (Human)
Description:
P15538
Residue:
503
  
Inhibitor
Name:
BDBM336332
Synonyms:
1-(7-fluoro-5- (pyridine-3-yl) indolin-1-yl) ethanone | US9745282, 12
Type:
Small organic molecule
Emp. Form.:
C15H13FN2O
Mol. Mass.:
256.2749
SMILES:
CC(=O)N1CCc2cc(cc(F)c12)-c1cccnc1
: