Target
Cytochrome P450 11B1, mitochondrial
Ligand
BDBM336519
Substrate
IC50
540±n/a nM
Citation
 Ali, ALo, MMMetzger, EYin, LHartmann, RHu, QHeim, RZimmer, C Indoline compounds as aldosterone synthase inhibitors US Patent  US9745282 Publication Date 8/29/2017 
Target
Name:
Cytochrome P450 11B1, mitochondrial
Synonyms:
C11B1_HUMAN CYPXIB1 Cytochrome P450 11B1 Cytochrome P450 11B1, mitochondrial | S11BH
Type:
Enzyme
Mol. Mass.:
57591.44
Organism:
Homo sapiens (Human)
Description:
P15538
Residue:
503
  
Inhibitor
Name:
BDBM336519
Synonyms:
5-(1-acetyl-7- fluoroindolin-5-yl)- 4-methylnicotino nitrile | US9745282, 17
Type:
Small organic molecule
Emp. Form.:
C17H14FN3O
Mol. Mass.:
295.311
SMILES:
CC(=O)N1CCc2cc(cc(F)c12)-c1cncc(C#N)c1C
: