Target
Cytochrome P450 11B1, mitochondrial
Ligand
BDBM336520
Substrate
IC50
68.0±n/a nM
Citation
 Ali, ALo, MMMetzger, EYin, LHartmann, RHu, QHeim, RZimmer, C Indoline compounds as aldosterone synthase inhibitors US Patent  US9745282 Publication Date 8/29/2017 
Target
Name:
Cytochrome P450 11B1, mitochondrial
Synonyms:
C11B1_HUMAN CYPXIB1 Cytochrome P450 11B1 Cytochrome P450 11B1, mitochondrial | S11BH
Type:
Enzyme
Mol. Mass.:
57591.44
Organism:
Homo sapiens (Human)
Description:
P15538
Residue:
503
  
Inhibitor
Name:
BDBM336520
Synonyms:
1-(7-fluoro-5-(4- methylpyridin-3- yl)indolin-1-yl) ethanone | US9745282, 15
Type:
Small organic molecule
Emp. Form.:
C16H15FN2O
Mol. Mass.:
270.3015
SMILES:
CC(=O)N1CCc2cc(cc(F)c12)-c1cnccc1C
: