Target
Cytochrome P450 11B2, mitochondrial
Ligand
BDBM50019869
Substrate
Meas. Tech.
HTRF-Based Assay
IC50
23.0±n/a nM
Citation
 Ali, ALo, MMMetzger, EYin, LHartmann, RHu, QHeim, RZimmer, C Indoline compounds as aldosterone synthase inhibitors US Patent  US9745282 Publication Date 8/29/2017 
Target
Name:
Cytochrome P450 11B2, mitochondrial
Synonyms:
Aldosterone Synthase (CYP11B2) Aldosterone-synthesizing enzyme CYP11B2 Cytochrome P450 11B2 Cytochrome P450 11B2, mitochondrial P-450C18 | Steroid 18-hydroxylase
Type:
Protein
Mol. Mass.:
57582.15
Organism:
Homo sapiens (Human)
Description:
P19099
Residue:
503
  
Inhibitor
Name:
BDBM50019869
Synonyms:
CHEMBL3287190 | US9745282, 50
Type:
Small organic molecule
Emp. Form.:
C15H12N2O
Mol. Mass.:
236.2686
SMILES:
CC(=O)n1ccc2cc(ccc12)-c1cccnc1
: