Target
Cytochrome P450 11B2, mitochondrial
Ligand
BDBM50019894
Substrate
Meas. Tech.
HTRF-Based Assay
IC50
55.0±n/a nM
Citation
 Ali, ALo, MMMetzger, EYin, LHartmann, RHu, QHeim, RZimmer, C Indoline compounds as aldosterone synthase inhibitors US Patent  US9745282 Publication Date 8/29/2017 
Target
Name:
Cytochrome P450 11B2, mitochondrial
Synonyms:
Aldosterone Synthase (CYP11B2) Aldosterone-synthesizing enzyme CYP11B2 Cytochrome P450 11B2 Cytochrome P450 11B2, mitochondrial P-450C18 | Steroid 18-hydroxylase
Type:
Protein
Mol. Mass.:
57582.15
Organism:
Homo sapiens (Human)
Description:
P19099
Residue:
503
  
Inhibitor
Name:
BDBM50019894
Synonyms:
CHEMBL3287186 | US9745282, 56
Type:
Small organic molecule
Emp. Form.:
C17H18N2O2
Mol. Mass.:
282.337
SMILES:
CC(O)c1cncc(c1)-c1ccc2N(CCc2c1)C(C)=O
: