Target
Hepatocyte growth factor receptor
Ligand
BDBM336641
Substrate
Meas. Tech.
Kinase Assay
IC50
<10±n/a nM
Citation
 Dandu, RRHudkins, RLJosef, KAProuty, CPTripathy, R Uracil derivatives as AXL and c-MET kinase inhibitors US Patent  US9745283 Publication Date 8/29/2017 
Target
Name:
Hepatocyte growth factor receptor
Synonyms:
Hepatocyte growth factor receptor Hepatocyte growth factor receptor (c-MET) MET Met proto-oncogene (hepatocyte growth factor receptor) Tyrosine-protein kinase Met (c-Met) c-Met kinase
Type:
Protein
Mol. Mass.:
155559.73
Organism:
Homo sapiens (Human)
Description:
P08581
Residue:
1390
  
Inhibitor
Name:
BDBM336641
Synonyms:
US9745283, Example 71
Type:
Small organic molecule
Emp. Form.:
C30H22F2N4O8
Mol. Mass.:
604.5145
SMILES:
COc1cc2nccc(Oc3ccc(NC(=O)c4cn(CC(O)=O)c(=O)n(-c5ccc(F)cc5)c4=O)cc3F)c2cc1OC
: