Target
Tyrosine-protein kinase receptor UFO
Ligand
BDBM336669
Substrate
Meas. Tech.
Kinase Assay
IC50
<10±n/a nM
Citation
 Dandu, RRHudkins, RLJosef, KAProuty, CPTripathy, R Uracil derivatives as AXL and c-MET kinase inhibitors US Patent  US9745283 Publication Date 8/29/2017 
Target
Name:
Tyrosine-protein kinase receptor UFO
Synonyms:
AXL TEL/AXL UFO | UFO_HUMAN
Type:
Enzyme
Mol. Mass.:
98316.97
Organism:
Homo sapiens (Human)
Description:
P30530
Residue:
894
  
Inhibitor
Name:
BDBM336669
Synonyms:
US9745283, Example 98
Type:
Small organic molecule
Emp. Form.:
C28H21FN4O6
Mol. Mass.:
528.4879
SMILES:
COc1cc2nccc(Oc3ccc(NC(=O)c4cn(CC#C)c(=O)n(CC#C)c4=O)cc3F)c2cc1OC
: