Target
Coagulation factor VII
Ligand
BDBM13554
Substrate
BDBM13553
Meas. Tech.
Serine Protease Inhibition Assay
pH
7.8±n/a
Temperature
295.15±n/a K
Ki
2±n/a nM
Citation
 Zbinden, KGObst-Sander, UHilpert, KKuhne, HBanner, DWBohm, HJStahl, MAckermann, JAlig, LWeber, LWessel, HPRiederer, MATschopp, TBLave, T Selective and orally bioavailable phenylglycine tissue factor/factor VIIa inhibitors. Bioorg Med Chem Lett 15:5344-52 (2005)  
Target
Name:
Coagulation factor VII
Synonyms:
Eptacog alfa FA7_HUMAN Factor VIIa (fVIIa) SPCA serum prothrombin conversion accelerator
Type:
Enzyme
Mol. Mass.:
51599.89
Organism:
Homo sapiens (Human)
Description:
Residue:
466
  
Inhibitor
Name:
BDBM13554
Synonyms:
(2S)-2-{2-[2-(benzenesulfonyl)-4-(benzyloxy)-5-methoxyphenyl]-2-[(4-carbamimidoylphenyl)amino]acetamido}-2-phenylacetic acid phenylglycine deriv. 2
Type:
Small organic molecule
Emp. Form.:
C37H34N4O7S
Mol. Mass.:
678.753
SMILES:
COc1cc(C(Nc2ccc(cc2)C(N)=N)C(=O)N[C@H](C(O)=O)c2ccccc2)c(cc1OCc1ccccc1)S(=O)(=O)c1ccccc1
:
Substrate
Name:
BDBM13553
Synonyms:
(2S)-5-carbamimidamido-2-{2-[(2R)-2-methanesulfonamido-3-phenylpropanamido]acetamido}-N-(4-nitrophenyl)pentanamide; acetic acid N-Methylsulfonyl-D-Phe-Gly-Arg-4-nitranilide acetate
Type:
Small organic molecule
Emp. Form.:
C24H32N8O7S
Mol. Mass.:
576.625
SMILES:
CS(=O)(=O)N[C@H](Cc1ccccc1)C(=O)NCC(=O)N[C@@H](CCCNC(N)=N)C(=O)Nc1ccc(cc1)[N+]([O-])=O
: