Target
Coagulation factor VII
Ligand
BDBM13565
Substrate
BDBM13553
Meas. Tech.
Serine Protease Inhibition Assay
pH
7.8±n/a
Temperature
295.15±n/a K
Ki
480±n/a nM
Citation
 Zbinden, KGObst-Sander, UHilpert, KKuhne, HBanner, DWBohm, HJStahl, MAckermann, JAlig, LWeber, LWessel, HPRiederer, MATschopp, TBLave, T Selective and orally bioavailable phenylglycine tissue factor/factor VIIa inhibitors. Bioorg Med Chem Lett 15:5344-52 (2005)  
Target
Name:
Coagulation factor VII
Synonyms:
Eptacog alfa FA7_HUMAN Factor VIIa (fVIIa) SPCA serum prothrombin conversion accelerator
Type:
Enzyme
Mol. Mass.:
51599.89
Organism:
Homo sapiens (Human)
Description:
Residue:
466
  
Inhibitor
Name:
BDBM13565
Synonyms:
2-[(4-carbamimidoylphenyl)amino]-2-{3-ethoxy-5-[(1-methylpiperidin-4-yl)oxy]phenyl}acetic acid | phenylglycine deriv. 13
Type:
Small organic molecule
Emp. Form.:
C23H30N4O4
Mol. Mass.:
426.5087
SMILES:
CCOc1cc(OC2CCN(C)CC2)cc(c1)C(Nc1ccc(cc1)C(N)=N)C(O)=O
:
Substrate
Name:
BDBM13553
Synonyms:
(2S)-5-carbamimidamido-2-{2-[(2R)-2-methanesulfonamido-3-phenylpropanamido]acetamido}-N-(4-nitrophenyl)pentanamide; acetic acid N-Methylsulfonyl-D-Phe-Gly-Arg-4-nitranilide acetate
Type:
Small organic molecule
Emp. Form.:
C24H32N8O7S
Mol. Mass.:
576.625
SMILES:
CS(=O)(=O)N[C@H](Cc1ccccc1)C(=O)NCC(=O)N[C@@H](CCCNC(N)=N)C(=O)Nc1ccc(cc1)[N+]([O-])=O
: