Target
Prothrombin
Ligand
BDBM13561
Substrate
BDBM13573
Meas. Tech.
Serine Protease Inhibition Assay
Ki
2900±n/a nM
Citation
 Zbinden, KGObst-Sander, UHilpert, KKuhne, HBanner, DWBohm, HJStahl, MAckermann, JAlig, LWeber, LWessel, HPRiederer, MATschopp, TBLave, T Selective and orally bioavailable phenylglycine tissue factor/factor VIIa inhibitors. Bioorg Med Chem Lett 15:5344-52 (2005)  
Target
Name:
Prothrombin
Synonyms:
Activation peptide fragment 1 Coagulation factor II Prothrombin precursor Thrombin heavy chain | Thrombin light chain
Type:
Protein
Mol. Mass.:
70029.57
Organism:
Homo sapiens (Human)
Description:
P00734
Residue:
622
  
Inhibitor
Name:
BDBM13561
Synonyms:
2-[(4-carbamimidoylphenyl)amino]-2-[3-ethenyl-5-(oxan-4-yloxy)phenyl]acetic acid | phenylglycine deriv. 9
Type:
Small organic molecule
Emp. Form.:
C22H25N3O4
Mol. Mass.:
395.4516
SMILES:
NC(=N)c1ccc(NC(C(O)=O)c2cc(OC3CCOCC3)cc(C=C)c2)cc1
:
Substrate
Name:
BDBM13573
Synonyms:
(2S)-5-carbamimidamido-N-(4-nitrophenyl)-2-{[(2S)-1-{[(2S)-5-oxopyrrolidin-2-yl]carbonyl}pyrrolidin-2-yl]formamido}pentanamide hydrochloride Glu-Pro-Arg-pNA L-Pyroglutamyl-L-prolyl-L-arginine-p-Nitroaniline S-2366
Type:
Small organic molecule
Emp. Form.:
C22H30N8O6
Mol. Mass.:
502.5236
SMILES:
[#7]\[#6](-[#7])=[#7]/[#6]-[#6]-[#6]-[#6@H](-[#7]-[#6](=O)-[#6@@H]-1-[#6]-[#6]-[#6]-[#7]-1-[#6](=O)-[#6@@H]-1-[#6]-[#6]-[#6](=O)-[#7]-1)-[#6](=O)-[#7]-c1ccc(cc1)-[#7+](-[#8-])=O
: