Target
Orexin/Hypocretin receptor type 1
Ligand
BDBM336769
Substrate
Meas. Tech.
FLIPR Ca2+ Flux Assay
IC50
10000±n/a nM
Citation
 Kuduk, SDSkudlarek, JW 2-pyridyloxy-4-ether orexin receptor antagonists US Patent  US9745284 Publication Date 8/29/2017 
Target
Name:
Orexin/Hypocretin receptor type 1
Synonyms:
HCRTR1 OX1R_HUMAN Orexin receptor type 1 (OR 1) Orexin receptor type 1 (OX1) Orexin receptor type 1 (OxR1) | Ox1r
Type:
Protein
Mol. Mass.:
47554.50
Organism:
Homo sapiens (Human)
Description:
O43613
Residue:
425
  
Inhibitor
Name:
BDBM336769
Synonyms:
4-(2,2-difluoroethoxy)-2- {[(3R,6R)-6-methyl-1-({2- [(methylsulfonyl)methyl] phenyl}carbonyl)piperidin-3- yl]oxy}pyridine | US9745284, 31
Type:
Small organic molecule
Emp. Form.:
C22H26F2N2O5S
Mol. Mass.:
468.514
SMILES:
C[C@@H]1CC[C@H](CN1C(=O)c1ccccc1CS(C)(=O)=O)Oc1cc(OCC(F)F)ccn1
: