Target
Orexin/Hypocretin receptor type 1
Ligand
BDBM336780
Substrate
Meas. Tech.
FLIPR Ca2+ Flux Assay
IC50
1637±n/a nM
Citation
 Kuduk, SDSkudlarek, JW 2-pyridyloxy-4-ether orexin receptor antagonists US Patent  US9745284 Publication Date 8/29/2017 
Target
Name:
Orexin/Hypocretin receptor type 1
Synonyms:
HCRTR1 OX1R_HUMAN Orexin receptor type 1 (OR 1) Orexin receptor type 1 (OX1) Orexin receptor type 1 (OxR1) | Ox1r
Type:
Protein
Mol. Mass.:
47554.50
Organism:
Homo sapiens (Human)
Description:
O43613
Residue:
425
  
Inhibitor
Name:
BDBM336780
Synonyms:
2-(2-{[(2R,5R)-2-Methyl-5-{[4-(1-methylethoxy)pyridin-2-yl]oxy}piperidin-1-yl]carbonyl}phenyl)pyrimidine | US9745284, 44
Type:
Small organic molecule
Emp. Form.:
C25H28N4O3
Mol. Mass.:
432.5148
SMILES:
CC(C)Oc1ccnc(O[C@@H]2CC[C@@H](C)N(C2)C(=O)c2ccccc2-c2ncccn2)c1
: