Target
Orexin receptor type 2
Ligand
BDBM336792
Substrate
Meas. Tech.
FLIPR Ca2+ Flux Assay
IC50
11.0±n/a nM
Citation
 Kuduk, SDSkudlarek, JW 2-pyridyloxy-4-ether orexin receptor antagonists US Patent  US9745284 Publication Date 8/29/2017 
Target
Name:
Orexin receptor type 2
Synonyms:
HCRTR2 OX2R_HUMAN Orexin receptor type 2 (OR-2) Orexin receptor type 2 (OX2R) Ox-2-R | Ox2-R
Type:
Protein
Mol. Mass.:
50710.53
Organism:
Homo sapiens (Human)
Description:
O43614
Residue:
444
  
Inhibitor
Name:
BDBM336792
Synonyms:
1-(2-{[(2R,5R)- 5-{[4- (difluoromethoxy) pyridin-2-yl]oxy}-2- methylpiperidin-1- yl]carbonyl}phenyl) cyclopropane- carbonitrile | US9745284, 56
Type:
Small organic molecule
Emp. Form.:
C23H23F2N3O3
Mol. Mass.:
427.4438
SMILES:
C[C@@H]1CC[C@H](CN1C(=O)c1ccccc1C1(CC1)C#N)Oc1cc(OC(F)F)ccn1
: