Target
Sodium channel protein type 9 subunit alpha
Ligand
BDBM336812
Substrate
Meas. Tech.
FLIPR Assay
IC50
242±23 nM
Citation
 Ni, CPark, JHShao, BZhou, X Pyrimidines and use thereof US Patent  US9745287 Publication Date 8/29/2017 
Target
Name:
Sodium channel protein type 9 subunit alpha
Synonyms:
NENA Peripheral sodium channel 1 SCN9A_HUMAN Voltage-gated sodium channel subunit Nav1.7 hNE-Na
Type:
Protein
Mol. Mass.:
226375.97
Organism:
Homo sapiens (Human)
Description:
Q15858
Residue:
1988
  
Inhibitor
Name:
BDBM336812
Synonyms:
6-(hydroxymethyl)-2-(4-(4- (trifluoromethyl)phenoxy)cyclohex-1- en-1-yl)pyrimidine-4-carboxamide | US9745287, Compound 54
Type:
Small organic molecule
Emp. Form.:
C19H18F3N3O3
Mol. Mass.:
393.3597
SMILES:
NC(=O)c1cc(CO)nc(n1)C1=CCC(CC1)Oc1ccc(cc1)C(F)(F)F
: