Target
Cytochrome P450 11B1, mitochondrial
Ligand
BDBM336826
Substrate
Meas. Tech.
Inhibition Assay
IC50
230±n/a nM
Citation
 Hornberger, KRMeyers, KMNemoto, PASurprenant, SYu, H Aldosterone synthase inhibitors US Patent  US9745289 Publication Date 8/29/2017 
Target
Name:
Cytochrome P450 11B1, mitochondrial
Synonyms:
C11B1_HUMAN CYPXIB1 Cytochrome P450 11B1 Cytochrome P450 11B1, mitochondrial | S11BH
Type:
Enzyme
Mol. Mass.:
57591.44
Organism:
Homo sapiens (Human)
Description:
P15538
Residue:
503
  
Inhibitor
Name:
BDBM336826
Synonyms:
US9745289, Compound 2A | US9745289, Compound 2B
Type:
Small organic molecule
Emp. Form.:
C18H15N3O3
Mol. Mass.:
321.33
SMILES:
NC(=O)c1cccc2OC(COc12)c1cncc(c1)C1(CC1)C#N
: