Target
Cytochrome P450 11B2, mitochondrial
Ligand
BDBM336830
Substrate
Meas. Tech.
Inhibition Assay
IC50
68.0±n/a nM
Citation
 Hornberger, KRMeyers, KMNemoto, PASurprenant, SYu, H Aldosterone synthase inhibitors US Patent  US9745289 Publication Date 8/29/2017 
Target
Name:
Cytochrome P450 11B2, mitochondrial
Synonyms:
Aldosterone Synthase (CYP11B2) Aldosterone-synthesizing enzyme CYP11B2 Cytochrome P450 11B2 Cytochrome P450 11B2, mitochondrial P-450C18 | Steroid 18-hydroxylase
Type:
Protein
Mol. Mass.:
57582.15
Organism:
Homo sapiens (Human)
Description:
P19099
Residue:
503
  
Inhibitor
Name:
BDBM336830
Synonyms:
US9745289, Compound 4A | US9745289, Compound 4B
Type:
Small organic molecule
Emp. Form.:
C14H12N2O3
Mol. Mass.:
256.2567
SMILES:
NC(=O)c1cccc2OC(COc12)c1cccnc1
: