Target
Cytochrome P450 11B1, mitochondrial
Ligand
BDBM336918
Substrate
Meas. Tech.
Inhibition Assay
IC50
1200±n/a nM
Citation
 Hornberger, KRMeyers, KMNemoto, PASurprenant, SYu, H Aldosterone synthase inhibitors US Patent  US9745289 Publication Date 8/29/2017 
Target
Name:
Cytochrome P450 11B1, mitochondrial
Synonyms:
C11B1_HUMAN CYPXIB1 Cytochrome P450 11B1 Cytochrome P450 11B1, mitochondrial | S11BH
Type:
Enzyme
Mol. Mass.:
57591.44
Organism:
Homo sapiens (Human)
Description:
P15538
Residue:
503
  
Inhibitor
Name:
BDBM336918
Synonyms:
US9745289, Compound 47A | US9745289, Compound 47B
Type:
Small organic molecule
Emp. Form.:
C19H20N2O5
Mol. Mass.:
356.3725
SMILES:
NC(=O)c1cccc2OC(COc12)c1cncc(OC2CCOCC2)c1
: