Target
Isoform 2 of MAP kinase-interacting serine/threonine-protein kinase 1 (MNK1a) 344D]
Ligand
BDBM337235
Substrate
Meas. Tech.
Kinase Assay
IC50
7.00±n/a nM
Citation
 Zorn, LEis, KSchulze, VSülzle, DPuehler, FLienau, PBömer, UPetersen, KHägebarth, A Amidoimidazopyridazines as MKNK-1 kinase inhibitors US Patent  US9745304 Publication Date 8/29/2017 
Target
Name:
Isoform 2 of MAP kinase-interacting serine/threonine-protein kinase 1 (MNK1a) 344D]
Synonyms:
Isoform 2 of MAP kinase-interacting serine/threonine-protein kinase 1 (MNK1a) 344D] MAP kinase signal-integrating kinase 1 (MNK1) (T344D) MAP kinase-interacting serine/threonine-protein kinase 1 (MKNK1) (T344D) MAP kinase-interacting serine/threonine-protein kinase 1 (MNK1a) [T344D] MKNK1 MKNK1_HUMAN MNK1a
Type:
Protein
Mol. Mass.:
47416.00
Organism:
Homo sapiens (Human)
Description:
Q9BUB5-2 with T344D
Residue:
424
  
Inhibitor
Name:
BDBM337235
Synonyms:
N-[3-(1-Benzofuran-2-yl)imidazo[1,2-b]pyridazin-6-yl]-2-cyclohexyl-2-hydroxyacetamide | US9745304, Example 4
Type:
Small organic molecule
Emp. Form.:
C22H22N4O3
Mol. Mass.:
390.4351
SMILES:
OC(C1CCCCC1)C(=O)Nc1ccc2ncc(-c3cc4ccccc4o3)n2n1
: