Target
Isoform 2 of MAP kinase-interacting serine/threonine-protein kinase 1 (MNK1a) 344D]
Ligand
BDBM337242
Substrate
Meas. Tech.
Kinase Assay
IC50
3.00±n/a nM
Citation
 Zorn, LEis, KSchulze, VSülzle, DPuehler, FLienau, PBömer, UPetersen, KHägebarth, A Amidoimidazopyridazines as MKNK-1 kinase inhibitors US Patent  US9745304 Publication Date 8/29/2017 
Target
Name:
Isoform 2 of MAP kinase-interacting serine/threonine-protein kinase 1 (MNK1a) 344D]
Synonyms:
Isoform 2 of MAP kinase-interacting serine/threonine-protein kinase 1 (MNK1a) 344D] MAP kinase signal-integrating kinase 1 (MNK1) (T344D) MAP kinase-interacting serine/threonine-protein kinase 1 (MKNK1) (T344D) MAP kinase-interacting serine/threonine-protein kinase 1 (MNK1a) [T344D] MKNK1 MKNK1_HUMAN MNK1a
Type:
Protein
Mol. Mass.:
47416.00
Organism:
Homo sapiens (Human)
Description:
Q9BUB5-2 with T344D
Residue:
424
  
Inhibitor
Name:
BDBM337242
Synonyms:
(5S)-1-[3-(1-Benzofuran-2-yl)imidazo[1,2-b]pyridazin-6-yl]-5-(hydroxymethyl)-pyrrolidin-2-one | US9745304, Example 11
Type:
Small organic molecule
Emp. Form.:
C19H16N4O3
Mol. Mass.:
348.3553
SMILES:
OC[C@@H]1CCC(=O)N1c1ccc2ncc(-c3cc4ccccc4o3)n2n1
: