Target
Mitogen-activated protein kinase 1
Ligand
BDBM272791
Substrate
Meas. Tech.
IMAP-FP assay
IC50
9.00±n/a nM
Citation
 Lim, JHuang, XFerguson, RDZhou, WBoyce, CWSiliphaivanh, PWitter, DJMaletic, MMKozlowski, JAWilson, KJ Compounds that are ERK inhibitors US Patent  US9745307 Publication Date 8/29/2017 
Target
Name:
Mitogen-activated protein kinase 1
Synonyms:
ERK2 Extracellular signal-regulated kinase 2 Extracellular signal-regulated kinase 2 (ERK2) MAPK 2 MK01_HUMAN Mitogen-activated protein kinase 1 (ERK-2) Mitogen-activated protein kinase 2 PRKM2 | p42-MAPK
Type:
Ser/Thr Protein Kinase
Mol. Mass.:
41392.76
Organism:
Homo sapiens (Human)
Description:
P28482
Residue:
360
  
Inhibitor
Name:
BDBM272791
Synonyms:
(R)-3-morpholino-6-(1-phenylethyl)-5,6-dihydro-1H-pyrazolo[4,3-g]quinazolin-7(8H)-one US10759805, Ex 42 | US9745307, Example 42
Type:
Small organic molecule
Emp. Form.:
C21H23N5O2
Mol. Mass.:
377.4396
SMILES:
C[C@@H](N1Cc2cc3c(n[nH]c3cc2NC1=O)N1CCOCC1)c1ccccc1
: