Target
Mitogen-activated protein kinase 1
Ligand
BDBM272792
Substrate
Meas. Tech.
IMAP-FP assay
IC50
48.0±n/a nM
Citation
 Lim, JHuang, XFerguson, RDZhou, WBoyce, CWSiliphaivanh, PWitter, DJMaletic, MMKozlowski, JAWilson, KJ Compounds that are ERK inhibitors US Patent  US9745307 Publication Date 8/29/2017 
Target
Name:
Mitogen-activated protein kinase 1
Synonyms:
ERK2 Extracellular signal-regulated kinase 2 Extracellular signal-regulated kinase 2 (ERK2) MAPK 2 MK01_HUMAN Mitogen-activated protein kinase 1 (ERK-2) Mitogen-activated protein kinase 2 PRKM2 | p42-MAPK
Type:
Ser/Thr Protein Kinase
Mol. Mass.:
41392.76
Organism:
Homo sapiens (Human)
Description:
P28482
Residue:
360
  
Inhibitor
Name:
BDBM272792
Synonyms:
US10065967, Example 43 US9745307, Example 43
Type:
Small organic molecule
Emp. Form.:
C17H15IN4O
Mol. Mass.:
418.2317
SMILES:
C[C@@H](N1Cc2cc3c(I)n[nH]c3cc2NC1=O)c1ccccc1
: