Target
Mitogen-activated protein kinase 1
Ligand
BDBM272795
Substrate
Meas. Tech.
IMAP-FP assay
IC50
0.200±n/a nM
Citation
 Lim, JHuang, XFerguson, RDZhou, WBoyce, CWSiliphaivanh, PWitter, DJMaletic, MMKozlowski, JAWilson, KJ Compounds that are ERK inhibitors US Patent  US9745307 Publication Date 8/29/2017 
Target
Name:
Mitogen-activated protein kinase 1
Synonyms:
ERT1 Extracellular signal-regulated kinase 2 MAP kinase 1 MAP kinase ERK2 MAPK 2 Mapk Mitogen-activated protein kinase 2 p42 | p42-MAPK
Type:
Protein
Mol. Mass.:
41278.65
Organism:
Mus musculus (Mouse)
Description:
P63085
Residue:
358
  
Inhibitor
Name:
BDBM272795
Synonyms:
6-benzyl-3-(2-methylpyridin-4-yl)-1,8-dihydro-7H-pyrazolo[4,3-g]quinolin-7-one US10301317, Example 6 US9624228, Example 6 | US9745307, Example 3
Type:
Small organic molecule
Emp. Form.:
C23H18N4O
Mol. Mass.:
366.4152
SMILES:
Cc1cc(ccn1)-c1n[nH]c2cc3[nH]c(=O)c(Cc4ccccc4)cc3cc12
: